Uploaded image for project: 'OpenNMS'
  1. OpenNMS
  2. NMS-8340

QuickAddNodeIT flapping during tearDown()

    XMLWordPrintable

    Details

    • Type: Bug
    • Status: Resolved (View Workflow)
    • Priority: Blocker
    • Resolution: Fixed
    • Affects Version/s: 18.0.0
    • Fix Version/s: 18.0.1
    • Component/s: Testing / JUnit
    • Security Level: Default (Default Security Scheme)
    • Labels:
      None

      Description

      I saw an intermittent failure in the QuickAddNodeIT smoke test at revision 379d577993eebad60ce1d2cf3694bdbcd699b61f:

      build	13-Apr-2016 22:09:11	Tests run: 1, Failures: 0, Errors: 1, Skipped: 0, Time elapsed: 263.706 sec <<< FAILURE! - in org.opennms.smoketest.QuickAddNodeIT
      build	13-Apr-2016 22:09:11	testQuickAddNode(org.opennms.smoketest.QuickAddNodeIT)  Time elapsed: 263.706 sec  <<< ERROR!
      build	13-Apr-2016 22:09:11	org.opennms.smoketest.OpenNMSTestException: 
      build	13-Apr-2016 22:09:11	org.openqa.selenium.TimeoutException: Timed out after 240 seconds waiting for org.opennms.smoketest.OpenNMSSeleniumTestCase$WaitForNodesInDatabase@388526fb
      build	13-Apr-2016 22:09:11	Build info: version: '2.53.0', revision: '35ae25b1534ae328c771e0856c93e187490ca824', time: '2016-03-15 10:43:46'
      build	13-Apr-2016 22:09:11	System info: host: 'ncstate.internal.opennms.com', ip: '172.20.1.201', os.name: 'Linux', os.arch: 'amd64', os.version: '4.2.0-35-generic', java.version: '1.8.0_77'
      build	13-Apr-2016 22:09:11	Driver info: org.openqa.selenium.firefox.FirefoxDriver
      build	13-Apr-2016 22:09:11	Capabilities [{applicationCacheEnabled=true, rotatable=false, handlesAlerts=true, databaseEnabled=true, version=45.0, platform=LINUX, nativeEvents=false, acceptSslCerts=true, webStorageEnabled=true, locationContextEnabled=true, browserName=firefox, takesScreenshot=true, javascriptEnabled=true, cssSelectorsEnabled=true}]
      build	13-Apr-2016 22:09:11	Session ID: d51391a2-069b-4523-abad-22cbfc366162
      build	13-Apr-2016 22:09:11		at org.opennms.smoketest.QuickAddNodeIT.tearDown(QuickAddNodeIT.java:69)
      build	13-Apr-2016 22:09:11	Caused by: org.openqa.selenium.TimeoutException: 
      build	13-Apr-2016 22:09:11	Timed out after 240 seconds waiting for org.opennms.smoketest.OpenNMSSeleniumTestCase$WaitForNodesInDatabase@388526fb
      build	13-Apr-2016 22:09:11	Build info: version: '2.53.0', revision: '35ae25b1534ae328c771e0856c93e187490ca824', time: '2016-03-15 10:43:46'
      build	13-Apr-2016 22:09:11	System info: host: 'ncstate.internal.opennms.com', ip: '172.20.1.201', os.name: 'Linux', os.arch: 'amd64', os.version: '4.2.0-35-generic', java.version: '1.8.0_77'
      build	13-Apr-2016 22:09:11	Driver info: org.openqa.selenium.firefox.FirefoxDriver
      build	13-Apr-2016 22:09:11	Capabilities [{applicationCacheEnabled=true, rotatable=false, handlesAlerts=true, databaseEnabled=true, version=45.0, platform=LINUX, nativeEvents=false, acceptSslCerts=true, webStorageEnabled=true, locationContextEnabled=true, browserName=firefox, takesScreenshot=true, javascriptEnabled=true, cssSelectorsEnabled=true}]
      build	13-Apr-2016 22:09:11	Session ID: d51391a2-069b-4523-abad-22cbfc366162
      build	13-Apr-2016 22:09:11		at org.opennms.smoketest.QuickAddNodeIT.tearDown(QuickAddNodeIT.java:69)
      

        Attachments

          Activity

            People

            • Assignee:
              ranger Benjamin Reed
              Reporter:
              seth Seth Leger
            • Votes:
              0 Vote for this issue
              Watchers:
              2 Start watching this issue

              Dates

              • Created:
                Updated:
                Resolved: