Uploaded image for project: 'OpenNMS'
  1. OpenNMS
  2. NMS-8904

DefaultTicketerServiceLayerIntegrationTest.testWire() failed

    XMLWordPrintable

    Details

    • Type: Bug
    • Status: Resolved (View Workflow)
    • Priority: Major
    • Resolution: Fixed
    • Affects Version/s: 19.0.0
    • Fix Version/s: 19.0.0
    • Component/s: Testing / JUnit
    • Security Level: Default (Default Security Scheme)
    • Labels:
      None

      Description

      This ticketer test appears to flap:

      build	22-Nov-2016 15:24:23	Tests run: 2, Failures: 2, Errors: 0, Skipped: 0, Time elapsed: 4.744 sec <<< FAILURE! - in org.opennms.netmgt.ticketd.DefaultTicketerServiceLayerIntegrationTest
      build	22-Nov-2016 15:24:23	testWire(org.opennms.netmgt.ticketd.DefaultTicketerServiceLayerIntegrationTest)  Time elapsed: 3.524 sec  <<< FAILURE!
      build	22-Nov-2016 15:24:23	java.lang.AssertionError: expected:<CLOSED> but was:<OPEN>
      build	22-Nov-2016 15:24:23		at org.junit.Assert.fail(Assert.java:88)
      build	22-Nov-2016 15:24:23		at org.junit.Assert.failNotEquals(Assert.java:834)
      build	22-Nov-2016 15:24:23		at org.junit.Assert.assertEquals(Assert.java:118)
      build	22-Nov-2016 15:24:23		at org.junit.Assert.assertEquals(Assert.java:144)
      build	22-Nov-2016 15:24:23		at org.opennms.netmgt.ticketd.DefaultTicketerServiceLayerIntegrationTest.testWire(DefaultTicketerServiceLayerIntegrationTest.java:138)
      build	22-Nov-2016 15:24:23	
      build	22-Nov-2016 15:24:23	testWire(org.opennms.netmgt.ticketd.DefaultTicketerServiceLayerIntegrationTest)  Time elapsed: 0.489 sec  <<< FAILURE!
      build	22-Nov-2016 15:24:23	java.lang.AssertionError: expected:<CLOSED> but was:<OPEN>
      build	22-Nov-2016 15:24:23		at org.junit.Assert.fail(Assert.java:88)
      build	22-Nov-2016 15:24:23		at org.junit.Assert.failNotEquals(Assert.java:834)
      build	22-Nov-2016 15:24:23		at org.junit.Assert.assertEquals(Assert.java:118)
      build	22-Nov-2016 15:24:23		at org.junit.Assert.assertEquals(Assert.java:144)
      build	22-Nov-2016 15:24:23		at org.opennms.netmgt.ticketd.DefaultTicketerServiceLayerIntegrationTest.testWire(DefaultTicketerServiceLayerIntegrationTest.java:138)
      build	22-Nov-2016 15:24:23	
      build	22-Nov-2016 15:24:24	Running org.opennms.netmgt.ticketd.DefaultTicketerServiceLayerTest
      error	22-Nov-2016 15:24:24	Initializing MockLogger.
      build	22-Nov-2016 15:24:24	2016-11-22 15:24:24,628 ERROR [main] org.opennms.netmgt.ticketd.DefaultTicketerServiceLayer - Unable to update ticket for alarm: Failed Update
      build	22-Nov-2016 15:24:24	2016-11-22 15:24:24,631 DEBUG [main] org.opennms.netmgt.dao.mock.MockEventIpcManager - StartEvent processing (1 remaining)
      build	22-Nov-2016 15:24:24	2016-11-22 15:24:24,665 DEBUG [main] org.opennms.netmgt.dao.mock.MockEventIpcManager - Received: Event: 
      build	22-Nov-2016 15:24:24	 CreationTime: Tue Nov 22 15:24:24 EST 2016
      build	22-Nov-2016 15:24:24	 Dbid: 0
      build	22-Nov-2016 15:24:24	 Nodeid: 0
      build	22-Nov-2016 15:24:24	 Parms: {
      build	22-Nov-2016 15:24:24	  reason = string(text): Failed Update
      build	22-Nov-2016 15:24:24	 }
      build	22-Nov-2016 15:24:24	 Source: Ticketd
      build	22-Nov-2016 15:24:24	 Time: Tue Nov 22 15:24:24 EST 2016
      build	22-Nov-2016 15:24:24	 Uei: uei.opennms.org/troubleTicket/communicationError
      build	22-Nov-2016 15:24:24	End Event
      build	22-Nov-2016 15:24:24	
      build	22-Nov-2016 15:24:24	2016-11-22 15:24:24,666 DEBUG [main] org.opennms.netmgt.dao.mock.MockEventIpcManager - Sending: Event: 
      build	22-Nov-2016 15:24:24	 CreationTime: Tue Nov 22 15:24:24 EST 2016
      build	22-Nov-2016 15:24:24	 Dbid: 1
      build	22-Nov-2016 15:24:24	 Nodeid: 0
      build	22-Nov-2016 15:24:24	 Parms: {
      build	22-Nov-2016 15:24:24	  reason = string(text): Failed Update
      build	22-Nov-2016 15:24:24	 }
      build	22-Nov-2016 15:24:24	 Source: Ticketd
      build	22-Nov-2016 15:24:24	 Time: Tue Nov 22 15:24:24 EST 2016
      build	22-Nov-2016 15:24:24	 Uei: uei.opennms.org/troubleTicket/communicationError
      build	22-Nov-2016 15:24:24	End Event
      build	22-Nov-2016 15:24:24	
      build	22-Nov-2016 15:24:24	2016-11-22 15:24:24,666 DEBUG [main] org.opennms.netmgt.dao.mock.MockEventIpcManager - Finished processing event (0 remaining)
      build	22-Nov-2016 15:24:24	2016-11-22 15:24:24,667 ERROR [main] org.opennms.netmgt.ticketd.DefaultTicketerServiceLayer - Unable to create ticket for alarm: Failed Create
      build	22-Nov-2016 15:24:24	org.opennms.api.integration.ticketing.PluginException: Failed Create
      build	22-Nov-2016 15:24:24		at org.easymock.internal.MockInvocationHandler.invoke(MockInvocationHandler.java:46)
      build	22-Nov-2016 15:24:24		at org.easymock.internal.ObjectMethodsFilter.invoke(ObjectMethodsFilter.java:94)
      build	22-Nov-2016 15:24:24		at com.sun.proxy.$Proxy6.saveOrUpdate(Unknown Source)
      build	22-Nov-2016 15:24:24		at org.opennms.netmgt.ticketd.DefaultTicketerServiceLayer.createTicketForAlarm(DefaultTicketerServiceLayer.java:195)
      build	22-Nov-2016 15:24:24		at org.opennms.netmgt.ticketd.DefaultTicketerServiceLayerTest.testFailedCreateTicketForAlarm(DefaultTicketerServiceLayerTest.java:298)
      build	22-Nov-2016 15:24:24		at sun.reflect.NativeMethodAccessorImpl.invoke0(Native Method)
      build	22-Nov-2016 15:24:24		at sun.reflect.NativeMethodAccessorImpl.invoke(NativeMethodAccessorImpl.java:62)
      build	22-Nov-2016 15:24:24		at sun.reflect.DelegatingMethodAccessorImpl.invoke(DelegatingMethodAccessorImpl.java:43)
      build	22-Nov-2016 15:24:24		at java.lang.reflect.Method.invoke(Method.java:497)
      build	22-Nov-2016 15:24:24		at org.junit.runners.model.FrameworkMethod$1.runReflectiveCall(FrameworkMethod.java:50)
      build	22-Nov-2016 15:24:24		at org.junit.internal.runners.model.ReflectiveCallable.run(ReflectiveCallable.java:12)
      build	22-Nov-2016 15:24:24		at org.junit.runners.model.FrameworkMethod.invokeExplosively(FrameworkMethod.java:47)
      build	22-Nov-2016 15:24:24		at org.junit.internal.runners.statements.InvokeMethod.evaluate(InvokeMethod.java:17)
      build	22-Nov-2016 15:24:24		at org.junit.internal.runners.statements.RunBefores.evaluate(RunBefores.java:26)
      build	22-Nov-2016 15:24:24		at org.junit.runners.ParentRunner.runLeaf(ParentRunner.java:325)
      build	22-Nov-2016 15:24:24		at org.junit.runners.BlockJUnit4ClassRunner.runChild(BlockJUnit4ClassRunner.java:78)
      build	22-Nov-2016 15:24:24		at org.junit.runners.BlockJUnit4ClassRunner.runChild(BlockJUnit4ClassRunner.java:57)
      build	22-Nov-2016 15:24:24		at org.junit.runners.ParentRunner$3.run(ParentRunner.java:290)
      build	22-Nov-2016 15:24:24		at org.junit.runners.ParentRunner$1.schedule(ParentRunner.java:71)
      build	22-Nov-2016 15:24:24		at org.junit.runners.ParentRunner.runChildren(ParentRunner.java:288)
      build	22-Nov-2016 15:24:24		at org.junit.runners.ParentRunner.access$000(ParentRunner.java:58)
      build	22-Nov-2016 15:24:24		at org.junit.runners.ParentRunner$2.evaluate(ParentRunner.java:268)
      build	22-Nov-2016 15:24:24		at org.junit.runners.ParentRunner.run(ParentRunner.java:363)
      build	22-Nov-2016 15:24:24		at org.apache.maven.surefire.junit4.JUnit4Provider.execute(JUnit4Provider.java:283)
      build	22-Nov-2016 15:24:24		at org.apache.maven.surefire.junit4.JUnit4Provider.executeWithRerun(JUnit4Provider.java:173)
      build	22-Nov-2016 15:24:24		at org.apache.maven.surefire.junit4.JUnit4Provider.executeTestSet(JUnit4Provider.java:153)
      build	22-Nov-2016 15:24:24		at org.apache.maven.surefire.junit4.JUnit4Provider.invoke(JUnit4Provider.java:128)
      build	22-Nov-2016 15:24:24		at org.apache.maven.surefire.booter.ForkedBooter.invokeProviderInSameClassLoader(ForkedBooter.java:203)
      build	22-Nov-2016 15:24:24		at org.apache.maven.surefire.booter.ForkedBooter.runSuitesInProcess(ForkedBooter.java:155)
      build	22-Nov-2016 15:24:24		at org.apache.maven.surefire.booter.ForkedBooter.main(ForkedBooter.java:103)
      build	22-Nov-2016 15:24:24	2016-11-22 15:24:24,695 DEBUG [main] org.opennms.netmgt.dao.mock.MockEventIpcManager - StartEvent processing (1 remaining)
      build	22-Nov-2016 15:24:24	2016-11-22 15:24:24,696 DEBUG [main] org.opennms.netmgt.dao.mock.MockEventIpcManager - Received: Event: 
      build	22-Nov-2016 15:24:24	 CreationTime: Tue Nov 22 15:24:24 EST 2016
      build	22-Nov-2016 15:24:24	 Dbid: 0
      build	22-Nov-2016 15:24:24	 Nodeid: 0
      build	22-Nov-2016 15:24:24	 Parms: {
      build	22-Nov-2016 15:24:24	  reason = string(text): Failed Create
      build	22-Nov-2016 15:24:24	 }
      build	22-Nov-2016 15:24:24	 Source: Ticketd
      build	22-Nov-2016 15:24:24	 Time: Tue Nov 22 15:24:24 EST 2016
      build	22-Nov-2016 15:24:24	 Uei: uei.opennms.org/troubleTicket/communicationError
      build	22-Nov-2016 15:24:24	End Event
      build	22-Nov-2016 15:24:24	
      build	22-Nov-2016 15:24:24	2016-11-22 15:24:24,696 DEBUG [main] org.opennms.netmgt.dao.mock.MockEventIpcManager - Sending: Event: 
      build	22-Nov-2016 15:24:24	 CreationTime: Tue Nov 22 15:24:24 EST 2016
      build	22-Nov-2016 15:24:24	 Dbid: 2
      build	22-Nov-2016 15:24:24	 Nodeid: 0
      build	22-Nov-2016 15:24:24	 Parms: {
      build	22-Nov-2016 15:24:24	  reason = string(text): Failed Create
      build	22-Nov-2016 15:24:24	 }
      build	22-Nov-2016 15:24:24	 Source: Ticketd
      build	22-Nov-2016 15:24:24	 Time: Tue Nov 22 15:24:24 EST 2016
      build	22-Nov-2016 15:24:24	 Uei: uei.opennms.org/troubleTicket/communicationError
      build	22-Nov-2016 15:24:24	End Event
      build	22-Nov-2016 15:24:24	
      build	22-Nov-2016 15:24:24	2016-11-22 15:24:24,696 DEBUG [main] org.opennms.netmgt.dao.mock.MockEventIpcManager - Finished processing event (0 remaining)
      build	22-Nov-2016 15:24:24	2016-11-22 15:24:24,697 ERROR [main] org.opennms.netmgt.ticketd.DefaultTicketerServiceLayer - Unable to set ticket state
      build	22-Nov-2016 15:24:24	2016-11-22 15:24:24,697 ERROR [main] org.opennms.netmgt.ticketd.DefaultTicketerServiceLayer - Unable to close ticket for alarm: Failed Close
      build	22-Nov-2016 15:24:24	org.opennms.api.integration.ticketing.PluginException: Failed Close
      build	22-Nov-2016 15:24:24		at org.easymock.internal.MockInvocationHandler.invoke(MockInvocationHandler.java:46)
      build	22-Nov-2016 15:24:24		at org.easymock.internal.ObjectMethodsFilter.invoke(ObjectMethodsFilter.java:94)
      build	22-Nov-2016 15:24:24		at com.sun.proxy.$Proxy6.get(Unknown Source)
      build	22-Nov-2016 15:24:24		at org.opennms.netmgt.ticketd.DefaultTicketerServiceLayer.setTicketState(DefaultTicketerServiceLayer.java:127)
      build	22-Nov-2016 15:24:24		at org.opennms.netmgt.ticketd.DefaultTicketerServiceLayer.closeTicketForAlarm(DefaultTicketerServiceLayer.java:159)
      build	22-Nov-2016 15:24:24		at org.opennms.netmgt.ticketd.DefaultTicketerServiceLayerTest.testFailedCloseTicketForAlarm(DefaultTicketerServiceLayerTest.java:254)
      build	22-Nov-2016 15:24:24		at sun.reflect.NativeMethodAccessorImpl.invoke0(Native Method)
      build	22-Nov-2016 15:24:24		at sun.reflect.NativeMethodAccessorImpl.invoke(NativeMethodAccessorImpl.java:62)
      build	22-Nov-2016 15:24:24		at sun.reflect.DelegatingMethodAccessorImpl.invoke(DelegatingMethodAccessorImpl.java:43)
      build	22-Nov-2016 15:24:24		at java.lang.reflect.Method.invoke(Method.java:497)
      build	22-Nov-2016 15:24:24		at org.junit.runners.model.FrameworkMethod$1.runReflectiveCall(FrameworkMethod.java:50)
      build	22-Nov-2016 15:24:24		at org.junit.internal.runners.model.ReflectiveCallable.run(ReflectiveCallable.java:12)
      build	22-Nov-2016 15:24:24		at org.junit.runners.model.FrameworkMethod.invokeExplosively(FrameworkMethod.java:47)
      build	22-Nov-2016 15:24:24		at org.junit.internal.runners.statements.InvokeMethod.evaluate(InvokeMethod.java:17)
      build	22-Nov-2016 15:24:24		at org.junit.internal.runners.statements.RunBefores.evaluate(RunBefores.java:26)
      build	22-Nov-2016 15:24:24		at org.junit.runners.ParentRunner.runLeaf(ParentRunner.java:325)
      build	22-Nov-2016 15:24:24		at org.junit.runners.BlockJUnit4ClassRunner.runChild(BlockJUnit4ClassRunner.java:78)
      build	22-Nov-2016 15:24:24		at org.junit.runners.BlockJUnit4ClassRunner.runChild(BlockJUnit4ClassRunner.java:57)
      build	22-Nov-2016 15:24:24		at org.junit.runners.ParentRunner$3.run(ParentRunner.java:290)
      build	22-Nov-2016 15:24:24		at org.junit.runners.ParentRunner$1.schedule(ParentRunner.java:71)
      build	22-Nov-2016 15:24:24		at org.junit.runners.ParentRunner.runChildren(ParentRunner.java:288)
      build	22-Nov-2016 15:24:24		at org.junit.runners.ParentRunner.access$000(ParentRunner.java:58)
      build	22-Nov-2016 15:24:24		at org.junit.runners.ParentRunner$2.evaluate(ParentRunner.java:268)
      build	22-Nov-2016 15:24:24		at org.junit.runners.ParentRunner.run(ParentRunner.java:363)
      build	22-Nov-2016 15:24:24		at org.apache.maven.surefire.junit4.JUnit4Provider.execute(JUnit4Provider.java:283)
      build	22-Nov-2016 15:24:24		at org.apache.maven.surefire.junit4.JUnit4Provider.executeWithRerun(JUnit4Provider.java:173)
      build	22-Nov-2016 15:24:24		at org.apache.maven.surefire.junit4.JUnit4Provider.executeTestSet(JUnit4Provider.java:153)
      build	22-Nov-2016 15:24:24		at org.apache.maven.surefire.junit4.JUnit4Provider.invoke(JUnit4Provider.java:128)
      build	22-Nov-2016 15:24:24		at org.apache.maven.surefire.booter.ForkedBooter.invokeProviderInSameClassLoader(ForkedBooter.java:203)
      build	22-Nov-2016 15:24:24		at org.apache.maven.surefire.booter.ForkedBooter.runSuitesInProcess(ForkedBooter.java:155)
      build	22-Nov-2016 15:24:24		at org.apache.maven.surefire.booter.ForkedBooter.main(ForkedBooter.java:103)
      build	22-Nov-2016 15:24:24	2016-11-22 15:24:24,698 DEBUG [main] org.opennms.netmgt.dao.mock.MockEventIpcManager - StartEvent processing (1 remaining)
      build	22-Nov-2016 15:24:24	2016-11-22 15:24:24,698 DEBUG [main] org.opennms.netmgt.dao.mock.MockEventIpcManager - Received: Event: 
      build	22-Nov-2016 15:24:24	 CreationTime: Tue Nov 22 15:24:24 EST 2016
      build	22-Nov-2016 15:24:24	 Dbid: 0
      build	22-Nov-2016 15:24:24	 Nodeid: 0
      build	22-Nov-2016 15:24:24	 Parms: {
      build	22-Nov-2016 15:24:24	  reason = string(text): Failed Close
      build	22-Nov-2016 15:24:24	 }
      build	22-Nov-2016 15:24:24	 Source: Ticketd
      build	22-Nov-2016 15:24:24	 Time: Tue Nov 22 15:24:24 EST 2016
      build	22-Nov-2016 15:24:24	 Uei: uei.opennms.org/troubleTicket/communicationError
      build	22-Nov-2016 15:24:24	End Event
      build	22-Nov-2016 15:24:24	
      build	22-Nov-2016 15:24:24	2016-11-22 15:24:24,699 DEBUG [main] org.opennms.netmgt.dao.mock.MockEventIpcManager - Sending: Event: 
      build	22-Nov-2016 15:24:24	 CreationTime: Tue Nov 22 15:24:24 EST 2016
      build	22-Nov-2016 15:24:24	 Dbid: 3
      build	22-Nov-2016 15:24:24	 Nodeid: 0
      build	22-Nov-2016 15:24:24	 Parms: {
      build	22-Nov-2016 15:24:24	  reason = string(text): Failed Close
      build	22-Nov-2016 15:24:24	 }
      build	22-Nov-2016 15:24:24	 Source: Ticketd
      build	22-Nov-2016 15:24:24	 Time: Tue Nov 22 15:24:24 EST 2016
      build	22-Nov-2016 15:24:24	 Uei: uei.opennms.org/troubleTicket/communicationError
      build	22-Nov-2016 15:24:24	End Event
      build	22-Nov-2016 15:24:24	
      build	22-Nov-2016 15:24:24	2016-11-22 15:24:24,699 DEBUG [main] org.opennms.netmgt.dao.mock.MockEventIpcManager - Finished processing event (0 remaining)
      build	22-Nov-2016 15:24:24	2016-11-22 15:24:24,699 ERROR [main] org.opennms.netmgt.ticketd.DefaultTicketerServiceLayer - Unable to set ticket state
      build	22-Nov-2016 15:24:24	2016-11-22 15:24:24,699 ERROR [main] org.opennms.netmgt.ticketd.DefaultTicketerServiceLayer - Unable to cancel ticket for alarm: Failed Cancel
      build	22-Nov-2016 15:24:24	org.opennms.api.integration.ticketing.PluginException: Failed Cancel
      build	22-Nov-2016 15:24:24		at org.easymock.internal.MockInvocationHandler.invoke(MockInvocationHandler.java:46)
      build	22-Nov-2016 15:24:24		at org.easymock.internal.ObjectMethodsFilter.invoke(ObjectMethodsFilter.java:94)
      build	22-Nov-2016 15:24:24		at com.sun.proxy.$Proxy6.get(Unknown Source)
      build	22-Nov-2016 15:24:24		at org.opennms.netmgt.ticketd.DefaultTicketerServiceLayer.setTicketState(DefaultTicketerServiceLayer.java:127)
      build	22-Nov-2016 15:24:24		at org.opennms.netmgt.ticketd.DefaultTicketerServiceLayer.cancelTicketForAlarm(DefaultTicketerServiceLayer.java:113)
      build	22-Nov-2016 15:24:24		at org.opennms.netmgt.ticketd.DefaultTicketerServiceLayerTest.testFailedCancelTicketForAlarm(DefaultTicketerServiceLayerTest.java:141)
      build	22-Nov-2016 15:24:24		at sun.reflect.NativeMethodAccessorImpl.invoke0(Native Method)
      build	22-Nov-2016 15:24:24		at sun.reflect.NativeMethodAccessorImpl.invoke(NativeMethodAccessorImpl.java:62)
      build	22-Nov-2016 15:24:24		at sun.reflect.DelegatingMethodAccessorImpl.invoke(DelegatingMethodAccessorImpl.java:43)
      build	22-Nov-2016 15:24:24		at java.lang.reflect.Method.invoke(Method.java:497)
      build	22-Nov-2016 15:24:24		at org.junit.runners.model.FrameworkMethod$1.runReflectiveCall(FrameworkMethod.java:50)
      build	22-Nov-2016 15:24:24		at org.junit.internal.runners.model.ReflectiveCallable.run(ReflectiveCallable.java:12)
      build	22-Nov-2016 15:24:24		at org.junit.runners.model.FrameworkMethod.invokeExplosively(FrameworkMethod.java:47)
      build	22-Nov-2016 15:24:24		at org.junit.internal.runners.statements.InvokeMethod.evaluate(InvokeMethod.java:17)
      build	22-Nov-2016 15:24:24		at org.junit.internal.runners.statements.RunBefores.evaluate(RunBefores.java:26)
      build	22-Nov-2016 15:24:24		at org.junit.runners.ParentRunner.runLeaf(ParentRunner.java:325)
      build	22-Nov-2016 15:24:24		at org.junit.runners.BlockJUnit4ClassRunner.runChild(BlockJUnit4ClassRunner.java:78)
      build	22-Nov-2016 15:24:24		at org.junit.runners.BlockJUnit4ClassRunner.runChild(BlockJUnit4ClassRunner.java:57)
      build	22-Nov-2016 15:24:24		at org.junit.runners.ParentRunner$3.run(ParentRunner.java:290)
      build	22-Nov-2016 15:24:24		at org.junit.runners.ParentRunner$1.schedule(ParentRunner.java:71)
      build	22-Nov-2016 15:24:24		at org.junit.runners.ParentRunner.runChildren(ParentRunner.java:288)
      build	22-Nov-2016 15:24:24		at org.junit.runners.ParentRunner.access$000(ParentRunner.java:58)
      build	22-Nov-2016 15:24:24		at org.junit.runners.ParentRunner$2.evaluate(ParentRunner.java:268)
      build	22-Nov-2016 15:24:24		at org.junit.runners.ParentRunner.run(ParentRunner.java:363)
      build	22-Nov-2016 15:24:24		at org.apache.maven.surefire.junit4.JUnit4Provider.execute(JUnit4Provider.java:283)
      build	22-Nov-2016 15:24:24		at org.apache.maven.surefire.junit4.JUnit4Provider.executeWithRerun(JUnit4Provider.java:173)
      build	22-Nov-2016 15:24:24		at org.apache.maven.surefire.junit4.JUnit4Provider.executeTestSet(JUnit4Provider.java:153)
      build	22-Nov-2016 15:24:24		at org.apache.maven.surefire.junit4.JUnit4Provider.invoke(JUnit4Provider.java:128)
      build	22-Nov-2016 15:24:24		at org.apache.maven.surefire.booter.ForkedBooter.invokeProviderInSameClassLoader(ForkedBooter.java:203)
      build	22-Nov-2016 15:24:24		at org.apache.maven.surefire.booter.ForkedBooter.runSuitesInProcess(ForkedBooter.java:155)
      build	22-Nov-2016 15:24:24		at org.apache.maven.surefire.booter.ForkedBooter.main(ForkedBooter.java:103)
      build	22-Nov-2016 15:24:24	2016-11-22 15:24:24,727 DEBUG [main] org.opennms.netmgt.dao.mock.MockEventIpcManager - StartEvent processing (1 remaining)
      build	22-Nov-2016 15:24:24	2016-11-22 15:24:24,727 DEBUG [main] org.opennms.netmgt.dao.mock.MockEventIpcManager - Received: Event: 
      build	22-Nov-2016 15:24:24	 CreationTime: Tue Nov 22 15:24:24 EST 2016
      build	22-Nov-2016 15:24:24	 Dbid: 0
      build	22-Nov-2016 15:24:24	 Nodeid: 0
      build	22-Nov-2016 15:24:24	 Parms: {
      build	22-Nov-2016 15:24:24	  reason = string(text): Failed Cancel
      build	22-Nov-2016 15:24:24	 }
      build	22-Nov-2016 15:24:24	 Source: Ticketd
      build	22-Nov-2016 15:24:24	 Time: Tue Nov 22 15:24:24 EST 2016
      build	22-Nov-2016 15:24:24	 Uei: uei.opennms.org/troubleTicket/communicationError
      build	22-Nov-2016 15:24:24	End Event
      build	22-Nov-2016 15:24:24	
      build	22-Nov-2016 15:24:24	2016-11-22 15:24:24,727 DEBUG [main] org.opennms.netmgt.dao.mock.MockEventIpcManager - Sending: Event: 
      build	22-Nov-2016 15:24:24	 CreationTime: Tue Nov 22 15:24:24 EST 2016
      build	22-Nov-2016 15:24:24	 Dbid: 4
      build	22-Nov-2016 15:24:24	 Nodeid: 0
      build	22-Nov-2016 15:24:24	 Parms: {
      build	22-Nov-2016 15:24:24	  reason = string(text): Failed Cancel
      build	22-Nov-2016 15:24:24	 }
      build	22-Nov-2016 15:24:24	 Source: Ticketd
      build	22-Nov-2016 15:24:24	 Time: Tue Nov 22 15:24:24 EST 2016
      build	22-Nov-2016 15:24:24	 Uei: uei.opennms.org/troubleTicket/communicationError
      build	22-Nov-2016 15:24:24	End Event
      build	22-Nov-2016 15:24:24	
      build	22-Nov-2016 15:24:24	2016-11-22 15:24:24,727 DEBUG [main] org.opennms.netmgt.dao.mock.MockEventIpcManager - Finished processing event (0 remaining)
      build	22-Nov-2016 15:24:24	2016-11-22 15:24:24,729 INFO [main] org.opennms.netmgt.ticketd.DefaultTicketerServiceLayer - Alarm with id 1 is not currently cleared. Ticket with id 'id' will not be closed.
      build	22-Nov-2016 15:24:24	2016-11-22 15:24:24,729 INFO [main] org.opennms.netmgt.ticketd.DefaultTicketerServiceLayer - Alarm with id 1 is currently cleared. No ticket will be created.
      build	22-Nov-2016 15:24:24	Tests run: 12, Failures: 0, Errors: 0, Skipped: 0, Time elapsed: 0.207 sec - in org.opennms.netmgt.ticketd.DefaultTicketerServiceLayerTest
      

        Attachments

          Activity

            People

            • Assignee:
              j-white Jesse White
              Reporter:
              seth Seth Leger
            • Votes:
              0 Vote for this issue
              Watchers:
              2 Start watching this issue

              Dates

              • Created:
                Updated:
                Resolved: